Reaction Details
TargetSubstance-P receptor
LigandBDBM50214736
Substrate/Competitorn/a
Meas. Tech.ChEMBL_143040 (CHEMBL750289)
Ki 32±n/a nM
Citation Armour, DRAston, NMMorriss, KMCongreve, MSHawcock, ABMarquess, DMordaunt, JERichards, SAWard, P 1,4-Benzodiazepin-2-one derived neurokinin-1 receptor antagonists Bioorg Med Chem Lett7:2037-2042 (1997)    Article
 
Substance-P receptor
Name:Substance-P receptor
Type:G Protein-Coupled Receptor (GPCR)
Mol. Mass.:46254.43
Organism:Homo sapiens (Human)
Description:P25103
Residue:407
BDBM50214736
NameBDBM50214736
Synonyms:CHEMBL304638
TypeSmall organic molecule
Emp. Form.C21H19F6N3O2
Mol. Mass.459.3849
SMILESCC1N(CC(=O)Nc2ccccc12)C(=O)N(C)Cc1cc(cc(c1)C(F)(F)F)C(F)(F)F