Reaction Details
TargetSubstance-P receptor
LigandBDBM50214735
Substrate/Competitorn/a
Meas. Tech.ChEMBL_143040 (CHEMBL750289)
Ki 1000±n/a nM
Citation Armour, DRAston, NMMorriss, KMCongreve, MSHawcock, ABMarquess, DMordaunt, JERichards, SAWard, P 1,4-Benzodiazepin-2-one derived neurokinin-1 receptor antagonists Bioorg Med Chem Lett7:2037-2042 (1997)    Article
 
Substance-P receptor
Name:Substance-P receptor
Type:G Protein-Coupled Receptor (GPCR)
Mol. Mass.:46254.43
Organism:Homo sapiens (Human)
Description:P25103
Residue:407
BDBM50214735
NameBDBM50214735
Synonyms:CHEMBL64698
TypeSmall organic molecule
Emp. Form.C22H21F6N3O2
Mol. Mass.473.4115
SMILESCC1N(CC(=O)N(C)c2ccccc12)C(=O)N(C)Cc1cc(cc(c1)C(F)(F)F)C(F)(F)F