Reaction Details
TargetMelatonin receptor type 1B
LigandBDBM50290002
Substrate/Competitorn/a
Meas. Tech.ChEBML_105262
Ki 1.4±n/a nM
Citation Li, PKChu, GHGillen, MLWitt-Enderby, PA Synthesis and receptor binding studies of quinolinic derivatives as melatonin receptor ligands Bioorg Med Chem Lett7:2177-2180 (1997)    Article
 
Melatonin receptor type 1B
Name:Melatonin receptor type 1B
Type:Enzyme
Mol. Mass.:40203.54
Organism:Homo sapiens (Human)
Description:P49286
Residue:362
BDBM50290002
NameBDBM50290002
Synonyms:CHEMBL69521 | N-[2-(6-Methoxy-quinolin-4-yl)-ethyl]-acetamide
TypeSmall organic molecule
Emp. Form.C14H16N2O2
Mol. Mass.244.289
SMILESCOc1ccc2nccc(CCNC(C)=O)c2c1