Reaction Details
TargetMelatonin receptor type 1B
LigandBDBM50290003
Substrate/Competitorn/a
Meas. Tech.ChEBML_105262
Ki 0.960000±n/a nM
Citation Li, PKChu, GHGillen, MLWitt-Enderby, PA Synthesis and receptor binding studies of quinolinic derivatives as melatonin receptor ligands Bioorg Med Chem Lett7:2177-2180 (1997)    Article
 
Melatonin receptor type 1B
Name:Melatonin receptor type 1B
Type:Enzyme
Mol. Mass.:40203.54
Organism:Homo sapiens (Human)
Description:P49286
Residue:362
BDBM50290003
NameBDBM50290003
Synonyms:CHEMBL306468 | N-[2-(6-Methoxy-quinolin-4-yl)-ethyl]-propionamide
TypeSmall organic molecule
Emp. Form.C15H18N2O2
Mol. Mass.258.3156
SMILESCCC(=O)NCCc1ccnc2ccc(OC)cc12