Reaction Details
TargetRetinoic acid receptor alpha
LigandBDBM50290137
Substrate/Competitorn/a
Meas. Tech.ChEBML_195161
Ki 3.1±n/a nM
Citation Wong, MFRepa, JJClagett-Dame, MCurley, RW Synthesis and receptor binding affinity of conformationally restricted retinoic acid analogues Bioorg Med Chem Lett7:2313-2318 (1997)    Article
 
Retinoic acid receptor alpha
Name:Retinoic acid receptor alpha
Type:PROTEIN
Mol. Mass.:50778.87
Organism:Homo sapiens (Human)
Description:ChEMBL_1466191
Residue:462
BDBM50290137
NameBDBM50290137
Synonyms:(2E,4E)-3-Methyl-5-{2-[(E)-2-(3,3,6,6-tetramethyl-cyclohex-1-enyl)-vinyl]-cyclopropyl}-penta-2,4-dienoic acid | CHEMBL74331
TypeSmall organic molecule
Emp. Form.C21H30O2
Mol. Mass.314.4617
SMILESC\C(\C=C\C1CC1\C=C\C1=CC(C)(C)CCC1(C)C)=C/C(O)=O