Reaction Details
TargetRetinoic acid receptor RXR-gamma
LigandBDBM50290138
Substrate/Competitorn/a
Meas. Tech.ChEBML_197244
Ki>2800±n/a nM
Citation Wong, MFRepa, JJClagett-Dame, MCurley, RW Synthesis and receptor binding affinity of conformationally restricted retinoic acid analogues Bioorg Med Chem Lett7:2313-2318 (1997)    Article
 
Retinoic acid receptor RXR-gamma
Name:Retinoic acid receptor RXR-gamma
Type:PROTEIN
Mol. Mass.:50878.26
Organism:Homo sapiens (Human)
Description:ChEMBL_197216
Residue:463
BDBM50290138
NameBDBM50290138
Synonyms:(2Z,4E)-3-Methyl-5-{2-[(E)-2-(3,3,6,6-tetramethyl-cyclohex-1-enyl)-vinyl]-cyclopropyl}-penta-2,4-dienoic acid | CHEMBL73973
TypeSmall organic molecule
Emp. Form.C21H30O2
Mol. Mass.314.4617
SMILESC\C(\C=C\C1CC1\C=C\C1=CC(C)(C)CCC1(C)C)=C\C(O)=O