Reaction Details
TargetRetinoic acid receptor alpha
LigandBDBM50290184
Substrate/Competitorn/a
Meas. Tech.ChEMBL_195308 (CHEMBL799863)
EC50 17±n/a nM
Citation Beard, RLTeng, MColon, DFDuong, TTThacher, SMArefieg, TChandraratna, RA Synthesis and biological activity of 1,2,3,4-tetrahydroquinoline and 3,4-(1H)-dihydroquinolin-2-one analogs of retinoic acid Bioorg Med Chem Lett7:2373-2378 (1997)    Article
 
Retinoic acid receptor alpha
Name:Retinoic acid receptor alpha
Type:PROTEIN
Mol. Mass.:50778.87
Organism:Homo sapiens (Human)
Description:ChEMBL_1466191
Residue:462
BDBM50290184
NameBDBM50290184
Synonyms:4-(1-Isopropyl-4,4-dimethyl-1,2,3,4-tetrahydro-quinolin-7-ylethynyl)-benzoic acid | CHEMBL80271
TypeSmall organic molecule
Emp. Form.C23H25NO2
Mol. Mass.347.4501
SMILESCC(C)N1CCC(C)(C)c2ccc(cc12)C#Cc1ccc(cc1)C(O)=O