Reaction Details
TargetRetinoic acid receptor alpha
LigandBDBM50032219
Substrate/Competitorn/a
Meas. Tech.ChEMBL_195307 (CHEMBL879144)
EC50 30±n/a nM
Citation Beard, RLTeng, MColon, DFDuong, TTThacher, SMArefieg, TChandraratna, RA Synthesis and biological activity of 1,2,3,4-tetrahydroquinoline and 3,4-(1H)-dihydroquinolin-2-one analogs of retinoic acid Bioorg Med Chem Lett7:2373-2378 (1997)    Article
 
Retinoic acid receptor alpha
Name:Retinoic acid receptor alpha
Type:PROTEIN
Mol. Mass.:50778.87
Organism:Homo sapiens (Human)
Description:ChEMBL_1466191
Residue:462
BDBM50032219
NameBDBM50032219
Synonyms:(E)-4-(2-(5,5,8,8-tetramethyl-5,6,7,8-tetrahydronaphthalen-2-yl)prop-1-enyl)benzoic acid 4-[(1E)-2-(5,5,8,8-TETRAMETHYL-5,6,7,8-TETRAHYDRONAPHTHALEN-2-YL)PROP-1-ENYL]BENZOIC ACID 4-[(E)-2-(5,6,7,8-tetrahydro-5,5,8,8-tetramethyl-2-naphthalenyl)-1-propenyl]benzoic acid CHEMBL275311 | US9963439, TTNPB
TypeSmall organic molecule
Emp. Form.C24H28O2
Mol. Mass.348.4779
SMILESC\C(=C/c1ccc(cc1)C(O)=O)c1ccc2c(c1)C(C)(C)CCC2(C)C