Reaction Details
TargetRetinoic acid receptor beta
LigandBDBM50290185
Substrate/Competitorn/a
Meas. Tech.ChEBML_195835
EC50 10±n/a nM
Citation Beard, RLTeng, MColon, DFDuong, TTThacher, SMArefieg, TChandraratna, RA Synthesis and biological activity of 1,2,3,4-tetrahydroquinoline and 3,4-(1H)-dihydroquinolin-2-one analogs of retinoic acid Bioorg Med Chem Lett7:2373-2378 (1997)    Article
 
Retinoic acid receptor beta
Name:Retinoic acid receptor beta
Type:PROTEIN
Mol. Mass.:50498.70
Organism:Homo sapiens (Human)
Description:ChEMBL_1458015
Residue:455
BDBM50290185
NameBDBM50290185
Synonyms:4-(1-Isopropyl-4,4-dimethyl-1,2,3,4-tetrahydro-quinolin-6-ylethynyl)-benzoic acid | CHEMBL311269
TypeSmall organic molecule
Emp. Form.C23H25NO2
Mol. Mass.347.4501
SMILESCC(C)N1CCC(C)(C)c2cc(ccc12)C#Cc1ccc(cc1)C(O)=O