Reaction Details
TargetProgesterone receptor
LigandBDBM50290341
Substrate/Competitorn/a
Meas. Tech.ChEBML_159701
IC50 2195±n/a nM
Citation Connolly, PJWetter, SKBeers, KNHamel, SCHaynes-Johnson, DKiddoe, MKraft, PLai, MTCampen, CPalmer, SPhillips, A Synthesis and progesterone receptor binding affinity of substituted 1-phenyl-7-benzyl-4,5,6,7-tetrahydro-1H-indazoles Bioorg Med Chem Lett7:2551-2556 (1997)    Article
 
Progesterone receptor
Name:Progesterone receptor
Type:PROTEIN
Mol. Mass.:98665.51
Organism:Oryctolagus cuniculus
Description:ChEMBL_775980
Residue:930
BDBM50290341
NameBDBM50290341
Synonyms:1-(4-Fluoro-phenyl)-7-(4-isopropyl-benzyl)-4,5,6,7-tetrahydro-1H-indazole-3-carbaldehyde | CHEMBL421536
TypeSmall organic molecule
Emp. Form.C24H25FN2O
Mol. Mass.376.4665
SMILESCC(C)c1ccc(CC2CCCc3c(C=O)nn(c23)-c2ccc(F)cc2)cc1