Reaction Details
TargetInterstitial collagenase
LigandBDBM50063917
Substrate/Competitorn/a
Meas. Tech.ChEMBL_70344 (CHEMBL677169)
IC50 5±n/a nM
Citation Miller, AAskew, MBeckett, RPBellamy, CLBone, EACoates, REDavidson, AHDrummond, AHHuxley, PMartin, FMSaroglou, LThompson, AJvan Dijk, SEWhittaker, M Inhibition of Matrix Metalloproteinases: An examination of the S1′ pocket Bioorg Med Chem Lett7:193-198 (1997)    Article
 
Interstitial collagenase
Name:Interstitial collagenase
Type:Enzyme
Mol. Mass.:54010.26
Organism:Homo sapiens (Human)
Description: P03956
Residue:469
BDBM50063917
NameBDBM50063917
Synonyms:(2S,3R)-N(4)-[(2S)-3,3-dimethyl-1-(methylamino)-1-oxobutan-2-yl]-N(1),2-dihydroxy-3-(2-methylpropyl)butanediamide cid_119031 | marimastat
TypeSmall organic molecule
Emp. Form.C15H29N3O5
Mol. Mass.331.4079
SMILESCNC(=O)[C@@H](NC(=O)[C@H](CC(C)C)[C@H](O)C(=O)NO)C(C)(C)C