Reaction Details
TargetSubstance-P receptor
LigandBDBM50290722
Substrate/Competitorn/a
Meas. Tech.ChEBML_205406
IC50 5.9±n/a nM
Citation Vaz, RJMaynard, GDKudlacz, EMBratton, LDKane, JMShatzer, SAKnippenberg, RW Use of CoMFA in validating the conformation used in designing 4-(1H-benzimidazole-2-carbonyl)piperidines with H1/NK1 receptor antagonist activity Bioorg Med Chem Lett7:2825-2830 (1997)    Article
 
Substance-P receptor
Name:Substance-P receptor
Type:Enzyme Catalytic Domain
Mol. Mass.:46261.42
Organism:GUINEA PIG
Description:Neurokinin NK1 TACR1 GUINEA PIG::P30547
Residue:407
BDBM50290722
NameBDBM50290722
Synonyms:CHEMBL98076 | [1-(4-Fluoro-benzyl)-1H-benzoimidazol-2-yl]-{1-[2-(4-methoxy-phenyl)-ethyl]-piperidin-4-ylidene}-amine
TypeSmall organic molecule
Emp. Form.C28H29FN4O
Mol. Mass.456.5545
SMILES[#6]-[#8]-c1ccc(-[#6]-[#6]-[#7]-2-[#6]-[#6]\[#6](-[#6]-[#6]-2)=[#7]/c2nc3ccccc3n2-[#6]-c2ccc(F)cc2)cc1