Reaction Details
TargetKappa-type opioid receptor
LigandBDBM50290968
Substrate/Competitorn/a
Meas. Tech.ChEBML_145675
EC50 22±n/a nM
Citation Sabin, VHorwell, DCMcKnight, ATBroqua, P trans N-Methyl-N-[2-(1-pyrrolidinyl)cyclohexyl] cycloprop-2-ene-1-carboxamides: Novel lipophilic kappa opioid agonists Bioorg Med Chem Lett7:291-296 (1997)    Article
 
Kappa-type opioid receptor
Name:Kappa-type opioid receptor
Type:G Protein-Coupled Receptor (GPCR)
Mol. Mass.:42648.76
Organism:Homo sapiens (Human)
Description:P41145
Residue:380
BDBM50290968
NameBDBM50290968
Synonyms:9H-Fluorene-9-carboxylic acid methyl-((1S,2S)-2-pyrrolidin-1-yl-cyclohexyl)-amide | CHEMBL98893
TypeSmall organic molecule
Emp. Form.C25H30N2O
Mol. Mass.374.5185
SMILESCN([C@H]1CCCC[C@@H]1N1CCCC1)C(=O)C1c2ccccc2-c2ccccc12