Reaction Details
TargetInterleukin-8
LigandBDBM50291119
Substrate/Competitorn/a
Meas. Tech.ChEBML_89094
Ki 4000±n/a nM
Citation Attwood, MRConway, EADunsdon, RMGreening, JRHanda, BKJones, PSJordan, SCKeech, EWilson, FX Peptide based inhibitors of interleukin-8: structural simplification and enhanced potency Bioorg Med Chem Lett7:429-432 (1997)    Article
 
Interleukin-8
Name:Interleukin-8
Type:PROTEIN
Mol. Mass.:11104.05
Organism:Homo sapiens (Human)
Description:ChEMBL_577736
Residue:99
BDBM50291119
NameBDBM50291119
Synonyms:CHEMBL267510 Interleukin-8 inhibitor, 14
TypeSmall organic molecule
Emp. Form.C99H137N19O32S2
Mol. Mass.2169.385
SMILESCSCC[C@H](NC(C)=O)C(=O)N[C@@H](Cc1c[nH]c2ccccc12)C(=O)N[C@@H](CC(O)=O)C(=O)N[C@@H](Cc1ccccc1)C(=O)N[C@@H](CC(O)=O)C(=O)N[C@@H](CC(O)=O)C(=O)NCCCCCCCCCCCC(=O)N[C@@H](CCSC)C(=O)N1CCC[C@H]1C(=O)N1CCC[C@H]1C(=O)N[C@@H](C)C(=O)N[C@@H](CC(O)=O)C(=O)N[C@@H](CCC(O)=O)C(=O)N[C@@H](CC(O)=O)C(=O)N[C@@H](Cc1ccc(O)cc1)C(=O)N[C@@H](CO)C(=O)N1CCC[C@H]1C(N)=O