Reaction Details
TargetInterleukin-8
LigandBDBM50213962
Substrate/Competitorn/a
Meas. Tech.ChEBML_89094
Ki 13000±n/a nM
Citation Attwood, MRConway, EADunsdon, RMGreening, JRHanda, BKJones, PSJordan, SCKeech, EWilson, FX Peptide based inhibitors of interleukin-8: structural simplification and enhanced potency Bioorg Med Chem Lett7:429-432 (1997)    Article
 
Interleukin-8
Name:Interleukin-8
Type:PROTEIN
Mol. Mass.:11104.05
Organism:Homo sapiens (Human)
Description:ChEMBL_577736
Residue:99
BDBM50213962
NameBDBM50213962
Synonyms:CHEMBL410765
TypeSmall organic molecule
Emp. Form.C112H150N24O38S2
Mol. Mass.2504.657
SMILESCSCC[C@H](NC(C)=O)C(=O)N[C@@H](Cc1c[nH]c2ccccc12)C(=O)N[C@@H](CC(O)=O)C(=O)N[C@@H](Cc1ccccc1)C(=O)N[C@@H](CC(O)=O)C(=O)N[C@@H](CC(O)=O)C(=O)N[C@@H](CC(C)C)C(=O)N[C@@H](CC(N)=O)C(=O)N[C@@H](Cc1ccccc1)C(=O)N[C@@H]([C@@H](C)O)C(=O)NCC(=O)N[C@@H](CCSC)C(=O)N1CCC[C@H]1C(=O)N1CCC[C@H]1C(=O)N[C@@H](C)C(=O)N[C@@H](CC(O)=O)C(=O)N[C@@H](CCC(O)=O)C(=O)N[C@@H](CC(O)=O)C(=O)N[C@@H](Cc1ccc(O)cc1)C(=O)N[C@@H](CO)C(=O)N1CCC[C@H]1C(N)=O