Reaction Details
TargetCytosolic phospholipase A2
LigandBDBM50291391
Substrate/Competitorn/a
Meas. Tech.ChEBML_81567
IC50 2000±n/a nM
Citation Springer, DMLuh, BYD'Andrea, SVBronson, JJMansuri, MMBurke, JRGregor, KRStanley, PLTramposch, KM Dicarboxylic acid inhibitors of phospholipase A2 Bioorg Med Chem Lett7:793-798 (1997)    Article
 
Cytosolic phospholipase A2
Name:Cytosolic phospholipase A2
Type:Protein
Mol. Mass.:85219.30
Organism:Homo sapiens (Human)
Description:P47712
Residue:749
BDBM50291391
NameBDBM50291391
Synonyms:3-[(E)-1-((E)-2-Carboxy-1-methyl-vinyl)-4-(5,5,8,8-tetramethyl-5,6,7,8-tetrahydro-anthracen-2-yl)-but-1-enyl]-benzoic acid | CHEMBL164883
TypeSmall organic molecule
Emp. Form.C33H36O4
Mol. Mass.496.6365
SMILESC\C(=C/C(O)=O)\C(=C\CCc1ccc2cc3c(cc2c1)C(C)(C)CCC3(C)C)\c1cccc(c1)C(O)=O