Reaction Details
Target5-hydroxytryptamine receptor 1A
LigandBDBM50164455
Substrate/Competitorn/a
Meas. Tech.ChEMBL_303530 (CHEMBL839644)
Ki 4.2±n/a nM
Citation López-Rodríguez, MLTejada, IMorcillo, MJFernández, EBenhamú, BTejada, IAyala, DViso, APardo, LManzanares, J Synthesis and structure-activity relationships of a new model of arylpiperazines. 8. Computational simulation of ligand-receptor interaction of 5-HT(1A)R agonists with selectivity over alpha1-adrenoceptors. J Med Chem48:2548-2558 (2005) 
 
5-hydroxytryptamine receptor 1A
Name:5-hydroxytryptamine receptor 1A
Type:G Protein-Coupled Receptor (GPCR)
Mol. Mass.:46445.29
Organism:Rattus norvegicus (rat)
Description:Binding assays were performed using rat hippocampal membranes.
Residue:422
BDBM50164455
NameBDBM50164455
Synonyms:(R)-2-[4-((R)-2-Methyl-4-naphthalen-1-yl-piperazin-1-yl)-butyl]-hexahydro-pyrrolo[1,2-a]pyrazine-1,4-dione | CHEMBL366206
TypeSmall organic molecule
Emp. Form.C26H34N4O2
Mol. Mass.434.5738
SMILESC[C@@H]1CN(CCN1CCCCN1CC(=O)N2CCCC2C1=O)c1cccc2ccccc12