Reaction Details
Target5-hydroxytryptamine receptor 1A
LigandBDBM50016822
Substrate/Competitorn/a
Meas. Tech.ChEMBL_303530 (CHEMBL839644)
Ki 2.4±n/a nM
Citation López-Rodríguez, MLTejada, IMorcillo, MJFernández, EBenhamú, BTejada, IAyala, DViso, APardo, LManzanares, J Synthesis and structure-activity relationships of a new model of arylpiperazines. 8. Computational simulation of ligand-receptor interaction of 5-HT(1A)R agonists with selectivity over alpha1-adrenoceptors. J Med Chem48:2548-2558 (2005) 
 
5-hydroxytryptamine receptor 1A
Name:5-hydroxytryptamine receptor 1A
Type:G Protein-Coupled Receptor (GPCR)
Mol. Mass.:46445.29
Organism:Rattus norvegicus (rat)
Description:Binding assays were performed using rat hippocampal membranes.
Residue:422
BDBM50016822
NameBDBM50016822
Synonyms:CHEMBL33150
TypeSmall organic molecule
Emp. Form.C24H30N4O2
Mol. Mass.406.5206
SMILESO=C1C2CCCN2C(=O)N1CCCCN1CCN(CC1)c1cccc2ccccc12