Reaction Details
TargetAcidic phospholipase A2 2
LigandBDBM50015214
Substrate/Competitorn/a
Meas. Tech.ChEMBL_503132 (CHEMBL987630)
IC50 2160000±n/a nM
Citation Cuélla, MJGiner, RMRecio, MCJust, MJMáñez, SRíos, JL Two fungal lanostane derivatives as phospholipase A2 inhibitors. J Nat Prod59:977-9 (1997) 
 
Acidic phospholipase A2 2
Name:Acidic phospholipase A2 2
Type:PROTEIN
Mol. Mass.:13343.23
Organism:Naja naja
Description:ChEMBL_482058
Residue:119
BDBM50015214
NameBDBM50015214
Synonyms:6-chloro-2-methoxy-9-acridinyl(4-diethylamino-1-methylbutyl)amine CHEMBL7568 N*4*-(6-Chloro-2-methoxy-acridin-9-yl)-N*1*,N*1*-diethyl-pentane-1,4-diamine N*4*-(6-Chloro-2-methoxy-acridin-9-yl)-N*1*,N*1*-diethyl-pentane-1,4-diamine ; (mepacrine) cid_237 | quinacrine
TypeSmall organic molecule
Emp. Form.C23H30ClN3O
Mol. Mass.399.957
SMILESCCN(CC)CCCC(C)Nc1c2ccc(Cl)cc2nc2ccc(OC)cc12