Reaction Details
TargetAldehyde dehydrogenase, mitochondrial
LigandBDBM50292380
Substrate/Competitorn/a
Meas. Tech.ChEMBL_482175 (CHEMBL960209)
IC50 720±n/a nM
Citation Shin, KHWoo, WSLim, SSShim, CSChung, HSKennelly, EJKinghorn, AD Elgonica-Dimers A and B, Two Potent Alcohol Metabolism Inhibitory Constituents of Aloe arborescens J Nat Prod60:1180-1182 (1997)    Article
 
Aldehyde dehydrogenase, mitochondrial
Name:Aldehyde dehydrogenase, mitochondrial
Type:PROTEIN
Mol. Mass.:56489.77
Organism:Rattus norvegicus
Description:ChEMBL_592877
Residue:519
BDBM50292380
NameBDBM50292380
Synonyms:10'-D-glucopyranosyl-1,8,1',8'-tetrahydroxy-3,3'-bis(hydroxymethyl)[7,10'-bianthracene]-9,10,9'-trione A CHEMBL494494
TypeSmall organic molecule
Emp. Form.C36H30O14
Mol. Mass.686.615
SMILESOC[C@H]1OC([C@H](O)[C@@H](O)[C@@H]1O)C1(c2ccc3C(=O)c4cc(CO)cc(O)c4C(=O)c3c2O)c2cccc(O)c2C(=O)c2c(O)cc(CO)cc12