Reaction Details
TargetMacrophage scavenger receptor types I and II
LigandBDBM50292390
Substrate/Competitorn/a
Meas. Tech.ChEMBL_550891 (CHEMBL997334)
IC50 5600±n/a nM
Citation Freyer, AJPatil, ADKillmer, LZuber, GMyers, CJohnson, RK Rigidone, a sesquiterpene o-quinone from the gorgonian Pseudopterogorgia rigida. J Nat Prod60:309-11 (1997) 
 
Macrophage scavenger receptor types I and II
Name:Macrophage scavenger receptor types I and II
Type:PROTEIN
Mol. Mass.:49756.01
Organism:Homo sapiens (Human)
Description:ChEMBL_101341
Residue:451
BDBM50292390
NameBDBM50292390
Synonyms:CHEMBL454185 | Rigidone
TypeSmall organic molecule
Emp. Form.C15H20O3
Mol. Mass.248.3175
SMILES[#6]\[#6](-[#6])=[#6]\[#6]-[#6]=[#6](-[#6])-c1c(-[#8])cc(-[#6])c(-[#8])c1-[#8]