Reaction Details
TargetSqualene synthase
LigandBDBM50292333
Substrate/Competitorn/a
Meas. Tech.ChEMBL_484347 (CHEMBL999228)
IC50 0.4±n/a nM
Citation Dufresne, CWilson, KESingh, SBZink, DLBergstrom, JDRew, DPolishook, JDMeinz, MHuang, LSilverman, KCLingham, RBMojena, MCascales, CPelaéz, FGibbs, JB Zaragozic Acids D and D2: Potent Inhibitors of Squalene Synthase and of Ras Farnesyl-Protein Transferase J Nat Prod56:1923-1929 (1993) 
 
Squalene synthase
Name:Squalene synthase
Type:PROTEIN
Mol. Mass.:48109.41
Organism:Rattus norvegicus
Description:ChEMBL_1336736
Residue:416
BDBM50292333
NameBDBM50292333
Synonyms:CHEMBL505374 | zaragozic acid C
TypeSmall organic molecule
Emp. Form.C40H50O14
Mol. Mass.754.8166
SMILESC[C@H](CCCc1ccccc1)\C=C\CCC(=O)O[C@@H]1[C@@H](O)[C@]2(CCC[C@@H](OC(C)=O)[C@H](C)Cc3ccccc3)O[C@@]1(C(O)=O)[C@@](O)([C@H](O2)C(O)=O)C(O)=O