Reaction Details
TargetHistamine H3 receptor
LigandBDBM50070217
Substrate/Competitorn/a
Meas. Tech.ChEMBL_481041 (CHEMBL996660)
IC50 500±n/a nM
Citation Mierzwa, RKing, AConover, MATozzi, SPuar, MSPatel, MCoval, SJPomponi, SA Verongamine, a Novel Bromotyrosine-Derived Histamine H3-Antagonist from the Marine Sponge Verongula gigantea J Nat Prod57:175-177 (1994) 
 
Histamine H3 receptor
Name:Histamine H3 receptor
Type:Enzyme Catalytic Domain
Mol. Mass.:48753.61
Organism:GUINEA PIG
Description:HISTAMINE H3 HRH3 GUINEA PIG::Q9JI35
Residue:445
BDBM50070217
NameBDBM50070217
Synonyms:3-(3-Bromo-4-methoxy-phenyl)-2-[(E)-hydroxyimino]-N-[2-(1H-imidazol-4-yl)-ethyl]-propionamide VERONGAMINE
TypeSmall organic molecule
Emp. Form.C15H17BrN4O3
Mol. Mass.381.224
SMILESCOc1ccc(CC(N=O)C(=O)NCCc2cnc[nH]2)cc1Br