Reaction Details
TargetEndothelin receptor type B
LigandBDBM50292477
Substrate/Competitorn/a
Meas. Tech.ChEMBL_507945 (CHEMBL937908)
IC50>500000±n/a nM
Citation Hussain, RADickey, JKRosser, MPMatson, JAKozlowski, MRBrittain, RJWebb, MLRose, PMFernandes, P A Novel Class of Non-Peptidic Endothelin Antagonists Isolated from the Medicinal Herb Phyllanthus niruri J Nat Prod58:1515-1520 (1995)    Article
 
Endothelin receptor type B
Name:Endothelin receptor type B
Type:Enzyme Catalytic Domain
Mol. Mass.:49664.00
Organism:Homo sapiens (Human)
Description:ENDOTHELIN B EDNRB HUMAN::P24530
Residue:442
BDBM50292477
NameBDBM50292477
Synonyms:CHEMBL453568 | phyllanthin
TypeSmall organic molecule
Emp. Form.C24H34O6
Mol. Mass.418.5232
SMILESCOC[C@H](Cc1ccc(OC)c(OC)c1)[C@H](COC)Cc1ccc(OC)c(OC)c1