Reaction Details
TargetEndothelin-1 receptor
LigandBDBM50292478
Substrate/Competitorn/a
Meas. Tech.ChEMBL_507944 (CHEMBL937907)
IC50 160000±n/a nM
Citation Hussain, RADickey, JKRosser, MPMatson, JAKozlowski, MRBrittain, RJWebb, MLRose, PMFernandes, P A Novel Class of Non-Peptidic Endothelin Antagonists Isolated from the Medicinal Herb Phyllanthus niruri J Nat Prod58:1515-1520 (1995)    Article
 
Endothelin-1 receptor
Name:Endothelin-1 receptor
Type:Enzyme Catalytic Domain
Mol. Mass.:48736.88
Organism:Homo sapiens (Human)
Description:P25101
Residue:427
BDBM50292478
NameBDBM50292478
Synonyms:(2S,4S)-5,8-dimethoxy-6-methyl-4-phenyl-1,2,3,4-tetrahydronaphthalene-2-carboxylic acid | CHEMBL453823
TypeSmall organic molecule
Emp. Form.C20H22O4
Mol. Mass.326.3863
SMILESCOc1cc(C)c(OC)c2[C@@H](C[C@@H](Cc12)C(O)=O)c1ccccc1