Reaction Details
TargetXanthine dehydrogenase/oxidase
LigandBDBM50129952
Substrate/Competitorn/a
Meas. Tech.ChEMBL_487004 (CHEMBL1015631)
IC50 35300±n/a nM
Citation Hayashi, TSawa, KKawasaki, MArisawa, MShimizu, MMorita, N Inhibition of Cow's Milk Xanthine Oxidase by Flavonoids J Nat Prod51:345-348 (1988) 
 
Xanthine dehydrogenase/oxidase
Name:Xanthine dehydrogenase/oxidase
Type:Protein
Mol. Mass.:146809.00
Organism:Bos taurus (Bovine)
Description:P80457
Residue:1332
BDBM50129952
NameBDBM50129952
Synonyms:2-(3-(5,7-dihydroxy-2-(4-hydroxyphenyl)-4-oxo-4H-chromen-8-yl)-4-hydroxyphenyl)-5,7-dihydroxy-4H-chromen-4-one Amentoflavone cid_5281600
TypeSmall organic molecule
Emp. Form.C30H18O10
Mol. Mass.538.4579
SMILESOc1ccc(cc1)-c1cc(=O)c2c(O)cc(O)c(-c3cc(ccc3O)-c3cc(O)c4c(cc(O)cc4=O)o3)c2o1