Reaction Details
TargetDNA topoisomerase 1
LigandBDBM50250996
Substrate/Competitorn/a
Meas. Tech.ChEMBL_482493 (CHEMBL956189)
IC50 100±n/a nM
Citation Hecht, SMBerry, DEMacKenzie, LJBusby, RWNasuti, CA A Strategy for Identifying Novel, Mechanistically Unique Inhibitors of Topoisomerase I J Nat Prod55:401-413 (1992) 
 
DNA topoisomerase 1
Name:DNA topoisomerase 1
Type:Enzyme
Mol. Mass.:90771.02
Organism:Homo sapiens (Human)
Description:P11387
Residue:765
BDBM50250996
NameBDBM50250996
Synonyms:CHEMBL525240 chebulagic acid | chebulanin
TypeSmall organic molecule
Emp. Form.C41H30O27
Mol. Mass.954.6607
SMILESO[C@H]1[C@H]2[C@H](CC(O)=O)C(=O)O[C@@H]3[C@H]4COC(=O)c5cc(c(O)c(O)c5O)-c5c(O)c(O)c(O)cc5C(=O)O[C@@H]3[C@@H](OC(=O)c3cc(O)c(O)c(OC1=O)c23)[C@H](OC(=O)c1cc(O)c(O)c(O)c1)O4