Reaction Details
TargetMatrix metalloproteinase-14
LigandBDBM26524
Substrate/Competitorn/a
Meas. Tech.ChEMBL_496901 (CHEMBL1001996)
Ki 4072000±n/a nM
Citation Mazzola, RDZhu, ZSinning, LMcKittrick, BLavey, BSpitler, JKozlowski, JNeng-Yang, SZhou, GGuo, ZOrth, PMadison, VSun, JLundell, DNiu, X Discovery of novel hydroxamates as highly potent tumor necrosis factor-alpha converting enzyme inhibitors. Part II: optimization of the S3' pocket. Bioorg Med Chem Lett18:5809-14 (2009) 
 
Matrix metalloproteinase-14
Name:Matrix metalloproteinase-14
Type:Protein
Mol. Mass.:65900.19
Organism:Homo sapiens (Human)
Description:P50281
Residue:582
BDBM26524
NameBDBM26524
Synonyms:(1R,2S)-1-({3-fluoro-4-[(2-phenylquinolin-4-yl)methoxy]phenyl}methyl)-2-N-hydroxycyclopropane-1,2-dicarboxamide | hydroxamate-cyclopropyl compound, 1
TypeSmall organic molecule
Emp. Form.C28H24FN3O4
Mol. Mass.485.5063
SMILESNC(=O)[C@@]1(Cc2ccc(OCc3cc(nc4ccccc34)-c3ccccc3)c(F)c2)C[C@@H]1C(=O)NO