Reaction Details
TargetDisintegrin and metalloproteinase domain-containing protein 10
LigandBDBM50292681
Substrate/Competitorn/a
Meas. Tech.ChEMBL_496902 (CHEMBL1001997)
Ki>10000000±n/a nM
Citation Mazzola, RDZhu, ZSinning, LMcKittrick, BLavey, BSpitler, JKozlowski, JNeng-Yang, SZhou, GGuo, ZOrth, PMadison, VSun, JLundell, DNiu, X Discovery of novel hydroxamates as highly potent tumor necrosis factor-alpha converting enzyme inhibitors. Part II: optimization of the S3' pocket. Bioorg Med Chem Lett18:5809-14 (2009) 
 
Disintegrin and metalloproteinase domain-containing protein 10
Name:Disintegrin and metalloproteinase domain-containing protein 10
Type:Enzyme
Mol. Mass.:84160.93
Organism:Homo sapiens (Human)
Description:O14672
Residue:748
BDBM50292681
NameBDBM50292681
Synonyms:(1S,2R)-N-hydroxy-2-((S)-2-(hydroxymethyl)pyrrolidine-1-carbonyl)-2-(4-((2-phenylquinolin-4-yl)methoxy)benzyl)cyclopropanecarboxamide | CHEMBL506057
TypeSmall organic molecule
Emp. Form.C33H33N3O5
Mol. Mass.551.6322
SMILESOC[C@@H]1CCCN1C(=O)[C@@]1(Cc2ccc(OCc3cc(nc4ccccc34)-c3ccccc3)cc2)C[C@@H]1C(=O)NO