Reaction Details
TargetStromelysin-1
LigandBDBM50292680
Substrate/Competitorn/a
Meas. Tech.ChEMBL_496899 (CHEMBL1001176)
Ki>10000000±n/a nM
Citation Mazzola, RDZhu, ZSinning, LMcKittrick, BLavey, BSpitler, JKozlowski, JNeng-Yang, SZhou, GGuo, ZOrth, PMadison, VSun, JLundell, DNiu, X Discovery of novel hydroxamates as highly potent tumor necrosis factor-alpha converting enzyme inhibitors. Part II: optimization of the S3' pocket. Bioorg Med Chem Lett18:5809-14 (2009) 
 
Stromelysin-1
Name:Stromelysin-1
Type:Enzyme
Mol. Mass.:53973.13
Organism:Homo sapiens (Human)
Description: P08254
Residue:477
BDBM50292680
NameBDBM50292680
Synonyms:(1S,2R)-2-cyano-N-hydroxy-2-(4-((2-phenylquinolin-4-yl)methoxy)benzyl)cyclopropanecarboxamide | CHEMBL497769
TypeSmall organic molecule
Emp. Form.C28H23N3O3
Mol. Mass.449.5005
SMILESONC(=O)[C@H]1C[C@]1(Cc1ccc(OCc2cc(nc3ccccc23)-c2ccccc2)cc1)C#N