Reaction Details
Target72 kDa type IV collagenase
LigandBDBM23487
Substrate/Competitorn/a
Meas. Tech.ChEMBL_496898 (CHEMBL1001175)
Ki 1000000±n/a nM
Citation Mazzola, RDZhu, ZSinning, LMcKittrick, BLavey, BSpitler, JKozlowski, JNeng-Yang, SZhou, GGuo, ZOrth, PMadison, VSun, JLundell, DNiu, X Discovery of novel hydroxamates as highly potent tumor necrosis factor-alpha converting enzyme inhibitors. Part II: optimization of the S3' pocket. Bioorg Med Chem Lett18:5809-14 (2009) 
 
72 kDa type IV collagenase
Name:72 kDa type IV collagenase
Type:Enzyme
Mol. Mass.:73870.36
Organism:Homo sapiens (Human)
Description: P08253
Residue:660
BDBM23487
NameBDBM23487
Synonyms:(1S,2R)-1-N-hydroxy-2-({4-[(2-methylquinolin-4-yl)methoxy]phenyl}methyl)cyclopropane-1,2-dicarboxamide hydroxamate deriv., 78
TypeSmall organic molecule
Emp. Form.C23H23N3O4
Mol. Mass.405.4464
SMILESCc1cc(COc2ccc(C[C@@]3(C[C@@H]3C(=O)NO)C(N)=O)cc2)c2ccccc2n1