Reaction Details
Target72 kDa type IV collagenase
LigandBDBM50292684
Substrate/Competitorn/a
Meas. Tech.ChEMBL_496898 (CHEMBL1001175)
Ki 7000000±n/a nM
Citation Mazzola, RDZhu, ZSinning, LMcKittrick, BLavey, BSpitler, JKozlowski, JNeng-Yang, SZhou, GGuo, ZOrth, PMadison, VSun, JLundell, DNiu, X Discovery of novel hydroxamates as highly potent tumor necrosis factor-alpha converting enzyme inhibitors. Part II: optimization of the S3' pocket. Bioorg Med Chem Lett18:5809-14 (2009) 
 
72 kDa type IV collagenase
Name:72 kDa type IV collagenase
Type:Enzyme
Mol. Mass.:73870.36
Organism:Homo sapiens (Human)
Description: P08253
Residue:660
BDBM50292684
NameBDBM50292684
Synonyms:(1R,2S)-ethyl 2-(hydroxycarbamoyl)-1-(4-((2-methylquinolin-4-yl)methoxy)benzyl)cyclopropanecarboxylate | CHEMBL497810
TypeSmall organic molecule
Emp. Form.C25H26N2O5
Mol. Mass.434.4843
SMILESCCOC(=O)[C@@]1(Cc2ccc(OCc3cc(C)nc4ccccc34)cc2)C[C@@H]1C(=O)NO