Reaction Details
TargetRibonuclease pancreatic
LigandBDBM50292723
Substrate/Competitorn/a
Meas. Tech.ChEMBL_493877 (CHEMBL944248)
Ki 7100±n/a nM
Citation Samanta, ALeonidas, DDDasgupta, SPathak, TZographos, SEOikonomakos, NG Morpholino, piperidino, and pyrrolidino derivatives of pyrimidine nucleosides as inhibitors of ribonuclease A: synthesis, biochemical, and crystallographic evaluation. J Med Chem52:932-42 (2009) 
 
Ribonuclease pancreatic
Name:Ribonuclease pancreatic
Type:Enzyme
Mol. Mass.:16468.79
Organism:Bison bison (American bison)
Description:carboxamidomethylated RNase A
Residue:150
BDBM50292723
NameBDBM50292723
Synonyms:(2R,3R,4R,5R)-2-(2,4-dioxo-3,4-dihydropyrimidin-1(2H)-yl)-4-hydroxy-5-(hydroxymethyl)tetrahydrofuran-3-yl dihydrogen phosphate PHOSPHORIC ACID MONO-[2-(2,4-DIOXO-3,4-DIHYDRO-2H-PYRIMIDIN-1-YL)-4-HYDROXY-5-HYDROXYMETHYL-TETRAHYDRO-FURAN-3-YL] ESTER | uridine 2'-phosphate
TypeSmall organic molecule
Emp. Form.C9H13N2O9P
Mol. Mass.324.1813
SMILESOC[C@H]1O[C@H]([C@H](OP(O)(O)=O)[C@@H]1O)n1ccc(=O)[nH]c1=O