Reaction Details
TargetSqualene synthase
LigandBDBM50292852
Substrate/Competitorn/a
Meas. Tech.ChEMBL_494372 (CHEMBL941165)
IC50 2±n/a nM
Citation Song, YLin, FYYin, FHensler, MRodrígues Poveda, CAMukkamala, DCao, RWang, HMorita, CTGonzález Pacanowska, DNizet, VOldfield, E Phosphonosulfonates are potent, selective inhibitors of dehydrosqualene synthase and staphyloxanthin biosynthesis in Staphylococcus aureus. J Med Chem52:976-88 (2009) 
 
Squalene synthase
Name:Squalene synthase
Type:PROTEIN
Mol. Mass.:48114.76
Organism:Homo sapiens (Human)
Description:ChEMBL_1352847
Residue:417
BDBM50292852
NameBDBM50292852
Synonyms:1-Phosphono-4-[3-(benzofuran-5-yloxy)phenyl]butylsulfonic Acid Tripotassium Salt | CHEMBL490300
TypeSmall organic molecule
Emp. Form.C18H16O8PS
Mol. Mass.423.355
SMILES[O-]P([O-])(=O)C(CCCc1cccc(Oc2ccc3occc3c2)c1)S([O-])(=O)=O