Reaction Details
TargetSqualene synthase
LigandBDBM50049215
Substrate/Competitorn/a
Meas. Tech.ChEMBL_494372 (CHEMBL941165)
IC50 3±n/a nM
Citation Song, YLin, FYYin, FHensler, MRodrígues Poveda, CAMukkamala, DCao, RWang, HMorita, CTGonzález Pacanowska, DNizet, VOldfield, E Phosphonosulfonates are potent, selective inhibitors of dehydrosqualene synthase and staphyloxanthin biosynthesis in Staphylococcus aureus. J Med Chem52:976-88 (2009) 
 
Squalene synthase
Name:Squalene synthase
Type:PROTEIN
Mol. Mass.:48114.76
Organism:Homo sapiens (Human)
Description:ChEMBL_1352847
Residue:417
BDBM50049215
NameBDBM50049215
Synonyms:1-Phosphono-4-[3-(2-benzylphenoxy)phenyl]butylsulfonic Acid Tripotassium Salt Tripotassium salt of4-[3-(2-Benzyl-phenoxy)-phenyl]-1-phosphono-butane-1-sulfonic acid
TypeSmall organic molecule
Emp. Form.C23H22O7PS
Mol. Mass.473.457
SMILES[O-]P([O-])(=O)C(CCCc1cccc(Oc2ccccc2Cc2ccccc2)c1)S([O-])(=O)=O