Reaction Details
TargetOrexin receptor type 2
LigandBDBM50292929
Substrate/Competitorn/a
Meas. Tech.ChEMBL_495790 (CHEMBL1007909)
IC50 8±n/a nM
Citation Boss, CBrisbare-Roch, CJenck, F Biomedical application of orexin/hypocretin receptor ligands in neuroscience. J Med Chem52:891-903 (2009) 
 
Orexin receptor type 2
Name:Orexin receptor type 2
Type:Protein
Mol. Mass.:50710.53
Organism:Homo sapiens (Human)
Description:O43614
Residue:444
BDBM50292929
NameBDBM50292929
Synonyms:CHEMBL455136 | almorexant
TypeSmall organic molecule
Emp. Form.C29H31F3N2O3
Mol. Mass.512.5632
SMILESCNC(=O)[C@H](N1CCc2cc(OC)c(OC)cc2[C@@H]1CCc1ccc(cc1)C(F)(F)F)c1ccccc1