Reaction Details
TargetGalanin receptor type 2
LigandBDBM50293028
Substrate/Competitorn/a
Meas. Tech.ChEMBL_518782 (CHEMBL960418)
Ki 16±n/a nM
Citation Zhang, LRobertson, CRGreen, BRPruess, THWhite, HSBulaj, G Structural requirements for a lipoamino acid in modulating the anticonvulsant activities of systemically active galanin analogues. J Med Chem52:1310-6 (2009) 
 
Galanin receptor type 2
Name:Galanin receptor type 2
Type:Enzyme Catalytic Domain
Mol. Mass.:41724.40
Organism:Homo sapiens (Human)
Description:Galanin R2 GALR2 HUMAN::O43603
Residue:387
BDBM50293028
NameBDBM50293028
Synonyms:(Sar)WTLNSAGYLLGPKK(Lys-lauroyl)K | CHEMBL507733
TypeSmall organic molecule
Emp. Form.C100H165N23O23
Mol. Mass.2057.5204
SMILESCCCCCCCCCCCC(=O)NCCCC[C@H](NC(=O)[C@H](CCCCN)NC(=O)[C@H](CCCCN)NC(=O)[C@@H]1CCCN1C(=O)CNC(=O)[C@H](CC(C)C)NC(=O)[C@H](CC(C)C)NC(=O)[C@H](Cc1ccc(O)cc1)NC(=O)CNC(=O)[C@H](C)NC(=O)[C@H](CO)NC(=O)[C@H](CC(N)=O)NC(=O)[C@H](CC(C)C)NC(=O)[C@@H](NC(=O)[C@H](Cc1c[nH]c2ccccc12)OC(=O)CNC)[C@@H](C)O)C(=O)N[C@@H](CCCCN)C(N)=O