Reaction Details
TargetC-C chemokine receptor type 1
LigandBDBM50293055
Substrate/Competitorn/a
Meas. Tech.ChEMBL_519456 (CHEMBL950882)
IC50 6±n/a nM
Citation Merritt, JRLiu, JQuadros, EMorris, MLLiu, RZhang, RJacob, BPostelnek, JHicks, CMChen, WKimble, EFRogers, WLO'Brien, LWhite, NDesai, HBansal, SKing, GOhlmeyer, MJAppell, KCWebb, ML Novel pyrrolidine ureas as C-C chemokine receptor 1 (CCR1) antagonists. J Med Chem52:1295-301 (2010) 
 
C-C chemokine receptor type 1
Name:C-C chemokine receptor type 1
Type:Enzyme
Mol. Mass.:41180.69
Organism:Homo sapiens (Human)
Description:P32246
Residue:355
BDBM50293055
NameBDBM50293055
Synonyms:(R)-N2-(4-Chlorobenzyl)-N1-[2,6-dimethyl-4-(trifluoromethyl)phenyl]-N2-methylpyrrolidine-1,2-dicarboxamide | CHEMBL475748
TypeSmall organic molecule
Emp. Form.C23H25ClF3N3O2
Mol. Mass.467.912
SMILESCN(Cc1ccc(Cl)cc1)C(=O)[C@H]1CCCN1C(=O)Nc1c(C)cc(cc1C)C(F)(F)F