Reaction Details
TargetLuciferin 4-monooxygenase
LigandBDBM50238226
Substrate/Competitorn/a
Meas. Tech.ChEMBL_514917 (CHEMBL972643)
IC50 38±n/a nM
Citation Auld, DSZhang, YQSouthall, NTRai, GLandsman, MMacLure, JLangevin, DThomas, CJAustin, CPInglese, J A basis for reduced chemical library inhibition of firefly luciferase obtained from directed evolution. J Med Chem52:1450-8 (2010) 
 
Luciferin 4-monooxygenase
Name:Luciferin 4-monooxygenase
Synonyms:LUCI_PHOPE
Type:PROTEIN
Mol. Mass.:60658.88
Organism:Photuris pennsylvanica
Description:ChEMBL_514919
Residue:545
BDBM50238226
NameBDBM50238226
TypeSmall organic molecule
Emp. Form.C19H13N3O
Mol. Mass.299.326
SMILESc1ccc(cc1)-c1ccc(cc1)-c1nc(no1)-c1ccccn1