Reaction Details
TargetLuciferin 4-monooxygenase
LigandBDBM50293123
Substrate/Competitorn/a
Meas. Tech.ChEMBL_514919 (CHEMBL972645)
IC50 3800±n/a nM
Citation Auld, DSZhang, YQSouthall, NTRai, GLandsman, MMacLure, JLangevin, DThomas, CJAustin, CPInglese, J A basis for reduced chemical library inhibition of firefly luciferase obtained from directed evolution. J Med Chem52:1450-8 (2010) 
 
Luciferin 4-monooxygenase
Name:Luciferin 4-monooxygenase
Synonyms:LUCI_PHOPE
Type:PROTEIN
Mol. Mass.:60658.88
Organism:Photuris pennsylvanica
Description:ChEMBL_514919
Residue:545
BDBM50293123
NameBDBM50293123
TypeSmall organic molecule
Emp. Form.C14H10ClNOS
Mol. Mass.275.753
SMILESCOc1ccc2nc(sc2c1)-c1ccc(Cl)cc1