Reaction Details
TargetLuciferin 4-monooxygenase
LigandBDBM50293107
Substrate/Competitorn/a
Meas. Tech.ChEMBL_514917 (CHEMBL972643)
IC50 580±n/a nM
Citation Auld, DSZhang, YQSouthall, NTRai, GLandsman, MMacLure, JLangevin, DThomas, CJAustin, CPInglese, J A basis for reduced chemical library inhibition of firefly luciferase obtained from directed evolution. J Med Chem52:1450-8 (2010) 
 
Luciferin 4-monooxygenase
Name:Luciferin 4-monooxygenase
Synonyms:LUCI_PHOPE
Type:PROTEIN
Mol. Mass.:60658.88
Organism:Photuris pennsylvanica
Description:ChEMBL_514919
Residue:545
BDBM50293107
NameBDBM50293107
TypeSmall organic molecule
Emp. Form.C15H11FN2O
Mol. Mass.254.259
SMILESCc1cccc(c1)-c1noc(n1)-c1ccc(F)cc1