Reaction Details
TargetLuciferin 4-monooxygenase
LigandBDBM50293126
Substrate/Competitorn/a
Meas. Tech.ChEMBL_514920 (CHEMBL972646)
IC50 8900±n/a nM
Citation Auld, DSZhang, YQSouthall, NTRai, GLandsman, MMacLure, JLangevin, DThomas, CJAustin, CPInglese, J A basis for reduced chemical library inhibition of firefly luciferase obtained from directed evolution. J Med Chem52:1450-8 (2010) 
 
Luciferin 4-monooxygenase
Name:Luciferin 4-monooxygenase
Type:PROTEIN
Mol. Mass.:60747.46
Organism:Photinus pyralis
Description:ChEMBL_938513
Residue:550
BDBM50293126
NameBDBM50293126
Synonyms:2-(2-(Benzyloxy)phenyl)-6-methoxybenzo[d]thiazole | CHEMBL460501
TypeSmall organic molecule
Emp. Form.C21H17NO2S
Mol. Mass.347.43
SMILESCOc1ccc2nc(sc2c1)-c1ccccc1OCc1ccccc1