Reaction Details
TargetCyclin-dependent kinase 2
LigandBDBM50293176
Substrate/Competitorn/a
Meas. Tech.ChEMBL_496946 (CHEMBL1002041)
IC50 7±n/a nM
Citation Choong, ICSerafimova, IFan, JStockett, DChan, ECheeti, SLu, YFahr, BPham, PArkin, MRWalker, DHHoch, U A diaminocyclohexyl analog of SNS-032 with improved permeability and bioavailability properties. Bioorg Med Chem Lett18:5763-5 (2009) 
 
Cyclin-dependent kinase 2
Name:Cyclin-dependent kinase 2
Type:Enzyme Subunit
Mol. Mass.:33938.17
Organism:Homo sapiens (Human)
Description:P24941
Residue:298
BDBM50293176
NameBDBM50293176
Synonyms:(trans)-4-(5-((5-tert-butyloxazol-2-yl)methylthio)thiazol-2-ylamino)cyclohexanol | CHEMBL495557
TypeSmall organic molecule
Emp. Form.C17H25N3O2S2
Mol. Mass.367.529
SMILESCC(C)(C)c1cnc(CSc2cnc(N[C@H]3CC[C@H](O)CC3)s2)o1