Reaction Details
TargetOrexin receptor type 2
LigandBDBM50293234
Substrate/Competitorn/a
Meas. Tech.ChEMBL_497220 (CHEMBL1006173)
IC50 4±n/a nM
Citation Aissaoui, HKoberstein, RZumbrunn, CGatfield, JBrisbare-Roch, CJenck, FTreiber, ABoss, C N-Glycine-sulfonamides as potent dual orexin 1/orexin 2 receptor antagonists. Bioorg Med Chem Lett18:5729-33 (2009) 
 
Orexin receptor type 2
Name:Orexin receptor type 2
Type:Protein
Mol. Mass.:50710.53
Organism:Homo sapiens (Human)
Description:O43614
Residue:444
BDBM50293234
NameBDBM50293234
Synonyms:2-(N-(2-chloro-5-(dimethylamino)phenyl)-3,4-dimethoxyphenylsulfonamido)-N-(1,5-dimethyl-1H-pyrazol-3-yl)-N-ethylacetamide | CHEMBL496979
TypeSmall organic molecule
Emp. Form.C25H32ClN5O5S
Mol. Mass.550.07
SMILESCCN(C(=O)CN(c1cc(ccc1Cl)N(C)C)S(=O)(=O)c1ccc(OC)c(OC)c1)c1cc(C)n(C)n1