Reaction Details
TargetPotassium voltage-gated channel subfamily A member 3
LigandBDBM50279106
Substrate/Competitorn/a
Meas. Tech.ChEMBL_571611 (CHEMBL1029465)
IC50 2±n/a nM
Citation Bodendiek, SBMahieux, CHänsel, WWulff, H 4-Phenoxybutoxy-substituted heterocycles--a structure-activity relationship study of blockers of the lymphocyte potassium channel Kv1.3. Eur J Med Chem44:1838-52 (2009) 
 
Potassium voltage-gated channel subfamily A member 3
Name:Potassium voltage-gated channel subfamily A member 3
Type:PROTEIN
Mol. Mass.:63835.47
Organism:Homo sapiens (Human)
Description:ChEMBL_1513935
Residue:575
BDBM50279106
NameBDBM50279106
Synonyms:4-(4-phenoxybutoxy)-7H-furo[3,2-g]chromen-7-one CHEMBL444449
TypeSmall organic molecule
Emp. Form.C21H18O5
Mol. Mass.350.3646
SMILESO=c1ccc2c(OCCCCOc3ccccc3)c3ccoc3cc2o1