Reaction Details
TargetTissue factor
LigandBDBM50293370
Substrate/Competitorn/a
Meas. Tech.ChEMBL_572140 (CHEMBL1024282)
IC50 233000±n/a nM
Citation Ayral, EGloanec, PBergé, Gde Nanteuil, GMennecier, PRupin, AVerbeuren, TJFulcrand, PMartinez, JHernandez, JF Design, synthesis, and biological evaluation of 1,5-benzothiazepine-4-one derivatives targeting factor VIIa/tissue factor. Bioorg Med Chem Lett19:1386-91 (2009) 
 
Tissue factor
Name:Tissue factor
Type:PROTEIN
Mol. Mass.:33067.61
Organism:Homo sapiens (Human)
Description:ChEMBL_936735
Residue:295
BDBM50293370
NameBDBM50293370
Synonyms:(S)-3-(3-acetamido-4-oxo-3,4-dihydrobenzo[b][1,4]thiazepin-5(2H)-yl)-N-(4-carbamimidoylbenzyl)propanamide, trifluoroacetate | CHEMBL557884
TypeSmall organic molecule
Emp. Form.C22H25N5O3S
Mol. Mass.439.531
SMILESCC(=O)N[C@@H]1CSc2ccccc2N(CCC(=O)NCc2ccc(cc2)C(N)=N)C1=O