Reaction Details
TargetTissue factor
LigandBDBM50293381
Substrate/Competitorn/a
Meas. Tech.ChEMBL_572140 (CHEMBL1024282)
IC50 24400±n/a nM
Citation Ayral, EGloanec, PBergé, Gde Nanteuil, GMennecier, PRupin, AVerbeuren, TJFulcrand, PMartinez, JHernandez, JF Design, synthesis, and biological evaluation of 1,5-benzothiazepine-4-one derivatives targeting factor VIIa/tissue factor. Bioorg Med Chem Lett19:1386-91 (2009) 
 
Tissue factor
Name:Tissue factor
Type:PROTEIN
Mol. Mass.:33067.61
Organism:Homo sapiens (Human)
Description:ChEMBL_936735
Residue:295
BDBM50293381
NameBDBM50293381
Synonyms:(R)-2-(3-amino-4-oxo-3,4-dihydrobenzo[b][1,4]thiazepin-5(2H)-yl)-N-(4-carbamimidoylbenzyl)acetamide, bistrifluoroacetate | CHEMBL557472
TypeSmall organic molecule
Emp. Form.C19H21N5O2S
Mol. Mass.383.467
SMILESN[C@H]1CSc2ccccc2N(CC(=O)NCc2ccc(cc2)C(N)=N)C1=O