Reaction Details
TargetCoagulation factor X
LigandBDBM50293390
Substrate/Competitorn/a
Meas. Tech.ChEMBL_572141 (CHEMBL1027710)
IC50 1630±n/a nM
Citation Ayral, EGloanec, PBergé, Gde Nanteuil, GMennecier, PRupin, AVerbeuren, TJFulcrand, PMartinez, JHernandez, JF Design, synthesis, and biological evaluation of 1,5-benzothiazepine-4-one derivatives targeting factor VIIa/tissue factor. Bioorg Med Chem Lett19:1386-91 (2009) 
 
Coagulation factor X
Name:Coagulation factor X
Type:Enzyme
Mol. Mass.:54726.60
Organism:Homo sapiens (Human)
Description:n/a
Residue:488
BDBM50293390
NameBDBM50293390
Synonyms:2-[(3S)-8-Amino-3-[benzylsulfonylamino]-4-oxo-3,4-dihydro-1,5-benzothiazepin-5(2H)-yl]-N-{4-[amino(imino)methyl]benzyl}-acetamide, bistrifluoroacetate | CHEMBL552698
TypeSmall organic molecule
Emp. Form.C26H28N6O4S2
Mol. Mass.552.668
SMILESNC(=N)c1ccc(CNC(=O)CN2c3ccc(N)cc3SC[C@@H](NS(=O)(=O)Cc3ccccc3)C2=O)cc1