Reaction Details
TargetTissue factor
LigandBDBM50293385
Substrate/Competitorn/a
Meas. Tech.ChEMBL_572140 (CHEMBL1024282)
IC50 1320±n/a nM
Citation Ayral, EGloanec, PBergé, Gde Nanteuil, GMennecier, PRupin, AVerbeuren, TJFulcrand, PMartinez, JHernandez, JF Design, synthesis, and biological evaluation of 1,5-benzothiazepine-4-one derivatives targeting factor VIIa/tissue factor. Bioorg Med Chem Lett19:1386-91 (2009) 
 
Tissue factor
Name:Tissue factor
Type:PROTEIN
Mol. Mass.:33067.61
Organism:Homo sapiens (Human)
Description:ChEMBL_936735
Residue:295
BDBM50293385
NameBDBM50293385
Synonyms:2-[(3S)-7-[2-Aminoethyl]-3-[benzylsulfonylamino]-4-oxo-3,4-dihydro-1,5-benzothiazepin-5(2H)-yl]-N-{4-[amino(imino)methyl]benzyl}-acetamide, bistrifluoroacetate | CHEMBL538929
TypeSmall organic molecule
Emp. Form.C28H32N6O4S2
Mol. Mass.580.721
SMILESNCCc1ccc2SC[C@@H](NS(=O)(=O)Cc3ccccc3)C(=O)N(CC(=O)NCc3ccc(cc3)C(N)=N)c2c1