Reaction Details
TargetTissue factor
LigandBDBM50293389
Substrate/Competitorn/a
Meas. Tech.ChEMBL_572140 (CHEMBL1024282)
IC50 2980±n/a nM
Citation Ayral, EGloanec, PBergé, Gde Nanteuil, GMennecier, PRupin, AVerbeuren, TJFulcrand, PMartinez, JHernandez, JF Design, synthesis, and biological evaluation of 1,5-benzothiazepine-4-one derivatives targeting factor VIIa/tissue factor. Bioorg Med Chem Lett19:1386-91 (2009) 
 
Tissue factor
Name:Tissue factor
Type:PROTEIN
Mol. Mass.:33067.61
Organism:Homo sapiens (Human)
Description:ChEMBL_936735
Residue:295
BDBM50293389
NameBDBM50293389
Synonyms:CHEMBL553237 | {(3S)-5-[2-({4-[Amino(imino)methyl]benzyl}amino)-2-oxoethyl]-3-[benzylsulfonylamino]-4-oxo-2,3,4,5-tetrahydro-1,5-benzothiazepin-7-yl}-acetic acid, trifluoroacetate
TypeSmall organic molecule
Emp. Form.C28H29N5O6S2
Mol. Mass.595.69
SMILESNC(=N)c1ccc(CNC(=O)CN2c3cc(CC(O)=O)ccc3SC[C@@H](NS(=O)(=O)Cc3ccccc3)C2=O)cc1